Reaction Details
TargetNeprilysin
LigandBDBM50048306
Substrate/Competitorn/a
Meas. Tech.ChEMBL_144596 (CHEMBL747371)
IC50 28±n/a nM
Citation Fink, CAQiao, YBerry, CJSakane, YGhai, RDTrapani, AJ New alpha-thiol dipeptide dual inhibitors of angiotensin-I converting enzyme and neutral endopeptidase EC 3.4.24.11. J Med Chem38:5023-30 (1996) Neprilysin
Name:Neprilysin
Type:Protein
Mol. Mass.:85789.59
Organism:Rattus norvegicus (Rat)
Description:P07861
Residue:750
BDBM50048306
NameBDBM50048306
Synonyms:(S)-2-[(S)-3-Biphenyl-4-yl-2-((S)-2-mercapto-3-methyl-butyrylamino)-propionylamino]-3-(4-hydroxy-phenyl)-propionic acid | CHEMBL358338
TypeSmall organic molecule
Emp. Form.C29H32N2O5S
Mol. Mass.520.64
SMILESCC(C)[C@H](S)C(=O)N[C@@H](Cc1ccc(cc1)-c1ccccc1)C(=O)N[C@@H](Cc1ccc(O)cc1)C(O)=O