Reaction Details
TargetNeprilysin
LigandBDBM50048315
Substrate/Competitorn/a
Meas. Tech.ChEMBL_144596 (CHEMBL747371)
IC50 2.2±n/a nM
Citation Fink, CAQiao, YBerry, CJSakane, YGhai, RDTrapani, AJ New alpha-thiol dipeptide dual inhibitors of angiotensin-I converting enzyme and neutral endopeptidase EC 3.4.24.11. J Med Chem38:5023-30 (1996) Neprilysin
Name:Neprilysin
Type:Protein
Mol. Mass.:85789.59
Organism:Rattus norvegicus (Rat)
Description:P07861
Residue:750
BDBM50048315
NameBDBM50048315
Synonyms:(S)-2-{[1-((S)-2-Mercapto-3-methyl-butyrylamino)-cyclopentanecarbonyl]-amino}-3-(4-methoxy-phenyl)-propionic acid | CHEMBL343691
TypeSmall organic molecule
Emp. Form.C21H30N2O5S
Mol. Mass.422.538
SMILESCOc1ccc(C[C@H](NC(=O)C2(CCCC2)NC(=O)[C@@H](S)C(C)C)C(O)=O)cc1