Reaction Details
TargetNeprilysin
LigandBDBM50048319
Substrate/Competitorn/a
Meas. Tech.ChEMBL_144596 (CHEMBL747371)
IC50 16±n/a nM
Citation Fink, CAQiao, YBerry, CJSakane, YGhai, RDTrapani, AJ New alpha-thiol dipeptide dual inhibitors of angiotensin-I converting enzyme and neutral endopeptidase EC 3.4.24.11. J Med Chem38:5023-30 (1996) Neprilysin
Name:Neprilysin
Type:Protein
Mol. Mass.:85789.59
Organism:Rattus norvegicus (Rat)
Description:P07861
Residue:750
BDBM50048319
NameBDBM50048319
Synonyms:(S)-3-Biphenyl-4-yl-2-{[1-((S)-2-mercapto-3-methyl-1-oxo-butylamino)-cyclopentanecarbonyl]-amino}-propionic acid 3-Biphenyl-4-yl-2-{[1-(2-mercapto-3-methyl-butyrylamino)-cyclopentanecarbonyl]-amino}-propionic acid CHEMBL64081
TypeSmall organic molecule
Emp. Form.C26H32N2O4S
Mol. Mass.468.608
SMILESCC(C)[C@H](S)C(=O)NC1(CCCC1)C(=O)N[C@@H](Cc1ccc(cc1)-c1ccccc1)C(O)=O