Reaction Details
TargetAngiotensin-converting enzyme
LigandBDBM50048322
Substrate/Competitorn/a
Meas. Tech.ChEMBL_34786 (CHEMBL643763)
IC50 11±n/a nM
Citation Fink, CAQiao, YBerry, CJSakane, YGhai, RDTrapani, AJ New alpha-thiol dipeptide dual inhibitors of angiotensin-I converting enzyme and neutral endopeptidase EC 3.4.24.11. J Med Chem38:5023-30 (1996) Angiotensin-converting enzyme
Name:Angiotensin-converting enzyme
Type:n/a
Mol. Mass.:150405.15
Organism:Oryctolagus cuniculus
Description:n/a
Residue:1310
BDBM50048322
NameBDBM50048322
Synonyms:(S)-3-(4-Hydroxy-phenyl)-2-{[4-((S)-2-mercapto-3-methyl-butyrylamino)-tetrahydro-pyran-4-carbonyl]-amino}-propionic acid | CHEMBL147899
TypeSmall organic molecule
Emp. Form.C20H28N2O6S
Mol. Mass.424.511
SMILESCC(C)[C@H](S)C(=O)NC1(CCOCC1)C(=O)N[C@@H](Cc1ccc(O)cc1)C(O)=O