Reaction Details
Target5-hydroxytryptamine receptor 2A
LigandBDBM50028600
Substrate/Competitorn/a
Meas. Tech.ChEMBL_2604 (CHEMBL617472)
Ki 3±n/a nM
Citation Phillips, STde Paulis, TNeergaard, JRBaron, BMSiegel, BWSeeman, PVan Tol, HHGuan, HCSmith, HE Binding of 5H-dibenzo[a,d]cycloheptene and dibenz[b,f]oxepin analogues of clozapine to dopamine and serotonin receptors. J Med Chem38:708-14 (1995) 5-hydroxytryptamine receptor 2A
Name:5-hydroxytryptamine receptor 2A
Type:G Protein-Coupled Receptor (GPCR)
Mol. Mass.:52852.05
Organism:Rattus norvegicus (rat)
Description:Rat cortex membranes 5-HT2A receptors.
Residue:471
BDBM50028600
NameBDBM50028600
Synonyms:1-(8-Chloro-dibenzo[b,f]oxepin-10-yl)-4-methyl-piperazine | CHEMBL90882
TypeSmall organic molecule
Emp. Form.C19H19ClN2O
Mol. Mass.326.82
SMILESCN1CCN(CC1)C1=Cc2ccccc2Oc2ccc(Cl)cc12