Reaction Details
TargetD(4) dopamine receptor
LigandBDBM50028598
Substrate/Competitorn/a
Meas. Tech.ChEMBL_63107 (CHEMBL674500)
Ki 2±n/a nM
Citation Phillips, STde Paulis, TNeergaard, JRBaron, BMSiegel, BWSeeman, PVan Tol, HHGuan, HCSmith, HE Binding of 5H-dibenzo[a,d]cycloheptene and dibenz[b,f]oxepin analogues of clozapine to dopamine and serotonin receptors. J Med Chem38:708-14 (1995) D(4) dopamine receptor
Name:D(4) dopamine receptor
Type:Enzyme
Mol. Mass.:48373.19
Organism:Homo sapiens (Human)
Description:P21917
Residue:419
BDBM50028598
NameBDBM50028598
Synonyms:1-Dibenzo[b,f]oxepin-10-yl-4-methyl-piperazine | CHEMBL89970
TypeSmall organic molecule
Emp. Form.C19H20N2O
Mol. Mass.292.3749
SMILESCN1CCN(CC1)C1=Cc2ccccc2Oc2ccccc12