Reaction Details
TargetDNA topoisomerase 1
LigandBDBM50034009
Substrate/Competitorn/a
Meas. Tech.ChEMBL_53722 (CHEMBL663650)
IC50 33±n/a nM
Citation Uehling, DENanthakumar, SSCroom, DEmerson, DLLeitner, PPLuzzio, MJMcIntyre, GMorton, BProfeta, SSisco, J Synthesis, topoisomerase I inhibitory activity, and in vivo evaluation of 11-azacamptothecin analogs. J Med Chem38:1106-18 (1995) DNA topoisomerase 1
Name:DNA topoisomerase 1
Type:Enzyme
Mol. Mass.:90771.02
Organism:Homo sapiens (Human)
Description:P11387
Residue:765
BDBM50034009
NameBDBM50034009
Synonyms:(S)-4,11-Diethyl-4-hydroxy-3,13-dioxo-3,4,12,13-tetrahydro-1H-2-oxa-6,8,12a-triaza-dibenzo[b,h]fluorene-9-carboxamidine | CHEMBL13349
TypeSmall organic molecule
Emp. Form.C22H21N5O4
Mol. Mass.419.4332
SMILESCCc1c2Cn3c(cc4c(COC(=O)[C@]4(O)CC)c3=O)-c2nc2cnc(cc12)C(N)=N