Reaction Details
TargetDNA topoisomerase 1
LigandBDBM50034024
Substrate/Competitorn/a
Meas. Tech.ChEMBL_53721 (CHEMBL663649)
IC50 217±n/a nM
Citation Uehling, DENanthakumar, SSCroom, DEmerson, DLLeitner, PPLuzzio, MJMcIntyre, GMorton, BProfeta, SSisco, J Synthesis, topoisomerase I inhibitory activity, and in vivo evaluation of 11-azacamptothecin analogs. J Med Chem38:1106-18 (1995) DNA topoisomerase 1
Name:DNA topoisomerase 1
Type:Enzyme
Mol. Mass.:90771.02
Organism:Homo sapiens (Human)
Description:P11387
Residue:765
BDBM50034024
NameBDBM50034024
Synonyms:((S)-4-Ethyl-4-hydroxy-11-methyl-3,13-dioxo-8-oxy-3,4,12,13-tetrahydro-1H-2-oxa-6,8,12a-triaza-dibenzo[b,h]fluoren-9-ylmethyl)-carbamic acid tert-butyl ester | CHEMBL13227
TypeSmall organic molecule
Emp. Form.C26H28N4O7
Mol. Mass.508.5231
SMILESCC[C@@]1(O)C(=O)OCc2c1cc1-c3nc4c[n+]([O-])c(CNC(=O)OC(C)(C)C)cc4c(C)c3Cn1c2=O