Reaction Details
TargetDelta-type opioid receptor
LigandBDBM50001683
Substrate/Competitorn/a
Meas. Tech.ChEMBL_145907 (CHEMBL750396)
IC50 4.1±n/a nM
Citation Bertha, CMFlippen-Anderson, JLRothman, RBPorreca, FDavis, PXu, HBecketts, KCha, XYRice, KC Probes for narcotic receptor-mediated phenomena. 20. Alteration of opioid receptor subtype selectivity of the 5-(3-hydroxyphenyl)morphans by application of the message-address concept: preparation of delta-opioid receptor ligands. J Med Chem38:1523-37 (1995) Delta-type opioid receptor
Name:Delta-type opioid receptor
Type:Enzyme Catalytic Domain
Mol. Mass.:40577.25
Organism:MOUSE
Description:P32300
Residue:372
BDBM50001683
NameBDBM50001683
Synonyms:13-[2-Amino-3-(4-hydroxy-phenyl)-propionylamino]-7-benzyl-3,3,14,14-tetramethyl-6,9,12-trioxo-1,2-dithia-5,8,11-triaza-cyclotetradecane-4-carboxylic acid CHEMBL294616 | DPDPE
TypeSmall organic molecule
Emp. Form.C30H39N5O7S2
Mol. Mass.645.79
SMILESCC1(C)SSC(C)(C)[C@@H](NC(=O)[C@@H](N)Cc2ccc(O)cc2)C(=O)NCC(=O)N[C@H](Cc2ccccc2)C(=O)N[C@H]1C(O)=O