Reaction Details
TargetMu-type opioid receptor
LigandBDBM50034620
Substrate/Competitorn/a
Meas. Tech.ChEMBL_148868 (CHEMBL753746)
Ki 31±n/a nM
Citation Brine, GAStark, PALiu, YCarroll, FISingh, PXu, HRothman, RB Enantiomers of diastereomeric cis-N-[1-(2-hydroxy-2-phenylethyl)- 3-methyl-4-piperidyl]-N-phenylpropanamides: synthesis, X-ray analysis, and biological activities. J Med Chem38:1547-57 (1995) Mu-type opioid receptor
Name:Mu-type opioid receptor
Type:G Protein-Coupled Receptor (GPCR)
Mol. Mass.:44503.11
Organism:Rattus norvegicus (rat)
Description:Competition binding assays were carried out using membrane preparations from transfected HN9.10 cells that constitutively expressed the mu opioid receptor.
Residue:398
BDBM50034620
NameBDBM50034620
Synonyms:CHEMBL290411 | N-((3S,4S)-3-Methyl-1-phenethyl-piperidin-4-yl)-N-phenyl-propionamide
TypeSmall organic molecule
Emp. Form.C23H30N2O
Mol. Mass.350.4971
SMILESCCC(=O)N([C@H]1CCN(CCc2ccccc2)C[C@@H]1C)c1ccccc1