Reaction Details
TargetcGMP-specific 3',5'-cyclic phosphodiesterase
LigandBDBM15296
Substrate/Competitorn/a
Meas. Tech.ChEMBL_155188 (CHEMBL761835)
IC50 5000±n/a nM
Citation Nomoto, YTakai, HOhno, TNagashima, KYao, KYamada, KKubo, KIchimura, MMihara, AKase, H Studies of cardiotonic agents. 8. Synthesis and biological activities of optically active 6-(4-(benzylamino)-7-quinazolinyl)-4,5-dihydro-5-methyl-3(2H)- pyridazinone (KF15232). J Med Chem39:297-303 (1996) 
 
cGMP-specific 3',5'-cyclic phosphodiesterase
Name:cGMP-specific 3',5'-cyclic phosphodiesterase
Type:PROTEIN
Mol. Mass.:98615.45
Organism:Bos taurus
Description:ChEMBL_155186
Residue:865
BDBM15296
NameBDBM15296
Synonyms:6-methyl-2-oxo-5-(pyridin-4-yl)-1,2-dihydropyridine-3-carbonitrile CHEMBL189 Primacor US9249139, Milrinone
TypeSmall organic molecule
Emp. Form.C12H9N3O
Mol. Mass.211.2194
SMILESCc1[nH]c(=O)c(cc1-c1ccncc1)C#N