Reaction Details
TargetcGMP-specific 3',5'-cyclic phosphodiesterase
LigandBDBM50049055
Substrate/Competitorn/a
Meas. Tech.ChEMBL_155188 (CHEMBL761835)
IC50 10±n/a nM
Citation Nomoto, YTakai, HOhno, TNagashima, KYao, KYamada, KKubo, KIchimura, MMihara, AKase, H Studies of cardiotonic agents. 8. Synthesis and biological activities of optically active 6-(4-(benzylamino)-7-quinazolinyl)-4,5-dihydro-5-methyl-3(2H)- pyridazinone (KF15232). J Med Chem39:297-303 (1996) 
 
cGMP-specific 3',5'-cyclic phosphodiesterase
Name:cGMP-specific 3',5'-cyclic phosphodiesterase
Type:PROTEIN
Mol. Mass.:98615.45
Organism:Bos taurus
Description:ChEMBL_155186
Residue:865
BDBM50049055
NameBDBM50049055
Synonyms:(R)-6-(4-Benzylamino-quinazolin-7-yl)-5-methyl-4,5-dihydro-2H-pyridazin-3-one | CHEMBL103976
TypeSmall organic molecule
Emp. Form.C20H19N5O
Mol. Mass.345.3978
SMILESC[C@@H]1CC(=O)NN=C1c1ccc2c(NCc3ccccc3)ncnc2c1