Reaction Details
TargetcGMP-specific 3',5'-cyclic phosphodiesterase
LigandBDBM50052081
Substrate/Competitorn/a
Meas. Tech.ChEMBL_155196 (CHEMBL763669)
IC50 53000±n/a nM
Citation Iwasaki, TKondo, KKuroda, TMoritani, YYamagata, SSugiura, MKikkawa, HKaminuma, OIkezawa, K Novel selective PDE IV inhibitors as antiasthmatic agents. Synthesis and biological activities of a series of 1-aryl-2,3-bis(hydroxymethyl)naphthalene lignans. J Med Chem39:2696-704 (1996) 
 
cGMP-specific 3',5'-cyclic phosphodiesterase
Name:cGMP-specific 3',5'-cyclic phosphodiesterase
Type:Protein
Mol. Mass.:99975.83
Organism:Homo sapiens (Human)
Description:O76074
Residue:875
BDBM50052081
NameBDBM50052081
Synonyms:CHEMBL91064 | [3-Hydroxymethyl-1-(3-methanesulfonyl-4,5-dimethoxy-phenyl)-6,7-dimethoxy-naphthalen-2-yl]-methanol
TypeSmall organic molecule
Emp. Form.C23H26O8S
Mol. Mass.462.513
SMILESCOc1cc2cc(CO)c(CO)c(-c3cc(OC)c(OC)c(c3)S(C)(=O)=O)c2cc1OC