Reaction Details
TargetcGMP-specific 3',5'-cyclic phosphodiesterase
LigandBDBM50052091
Substrate/Competitorn/a
Meas. Tech.ChEMBL_155196 (CHEMBL763669)
IC50 8000±n/a nM
Citation Iwasaki, TKondo, KKuroda, TMoritani, YYamagata, SSugiura, MKikkawa, HKaminuma, OIkezawa, K Novel selective PDE IV inhibitors as antiasthmatic agents. Synthesis and biological activities of a series of 1-aryl-2,3-bis(hydroxymethyl)naphthalene lignans. J Med Chem39:2696-704 (1996) 
 
cGMP-specific 3',5'-cyclic phosphodiesterase
Name:cGMP-specific 3',5'-cyclic phosphodiesterase
Type:Protein
Mol. Mass.:99975.83
Organism:Homo sapiens (Human)
Description:O76074
Residue:875
BDBM50052091
NameBDBM50052091
Synonyms:CHEMBL92491 | [3-Hydroxymethyl-6-methoxy-1-(3,4,5-trimethoxy-phenyl)-naphthalen-2-yl]-methanol
TypeSmall organic molecule
Emp. Form.C22H24O6
Mol. Mass.384.4224
SMILESCOc1ccc2c(c(CO)c(CO)cc2c1)-c1cc(OC)c(OC)c(OC)c1