Reaction Details
TargetcGMP-specific 3',5'-cyclic phosphodiesterase
LigandBDBM50052092
Substrate/Competitorn/a
Meas. Tech.ChEMBL_155196 (CHEMBL763669)
IC50 20000±n/a nM
Citation Iwasaki, TKondo, KKuroda, TMoritani, YYamagata, SSugiura, MKikkawa, HKaminuma, OIkezawa, K Novel selective PDE IV inhibitors as antiasthmatic agents. Synthesis and biological activities of a series of 1-aryl-2,3-bis(hydroxymethyl)naphthalene lignans. J Med Chem39:2696-704 (1996) 
 
cGMP-specific 3',5'-cyclic phosphodiesterase
Name:cGMP-specific 3',5'-cyclic phosphodiesterase
Type:Protein
Mol. Mass.:99975.83
Organism:Homo sapiens (Human)
Description:O76074
Residue:875
BDBM50052092
NameBDBM50052092
Synonyms:CHEMBL313143 | [3-Hydroxymethyl-6,7-dimethoxy-1-(3,4,5-trimethoxy-benzyl)-naphthalen-2-yl]-methanol
TypeSmall organic molecule
Emp. Form.C24H28O7
Mol. Mass.428.4749
SMILESCOc1cc(Cc2c(CO)c(CO)cc3cc(OC)c(OC)cc23)cc(OC)c1OC