Reaction Details
TargetcGMP-specific 3',5'-cyclic phosphodiesterase
LigandBDBM50052084
Substrate/Competitorn/a
Meas. Tech.ChEMBL_155196 (CHEMBL763669)
IC50 100000±n/a nM
Citation Iwasaki, TKondo, KKuroda, TMoritani, YYamagata, SSugiura, MKikkawa, HKaminuma, OIkezawa, K Novel selective PDE IV inhibitors as antiasthmatic agents. Synthesis and biological activities of a series of 1-aryl-2,3-bis(hydroxymethyl)naphthalene lignans. J Med Chem39:2696-704 (1996) 
 
cGMP-specific 3',5'-cyclic phosphodiesterase
Name:cGMP-specific 3',5'-cyclic phosphodiesterase
Type:Protein
Mol. Mass.:99975.83
Organism:Homo sapiens (Human)
Description:O76074
Residue:875
BDBM50052084
NameBDBM50052084
Synonyms:CHEMBL92043 | N-[5-(2,3-Bis-hydroxymethyl-6,7-dimethoxy-naphthalen-1-yl)-2,3-dimethoxy-phenyl]-acetamide
TypeSmall organic molecule
Emp. Form.C24H27NO7
Mol. Mass.441.4737
SMILESCOc1cc2cc(CO)c(CO)c(-c3cc(NC(C)=O)c(OC)c(OC)c3)c2cc1OC