Reaction Details
TargetcGMP-specific 3',5'-cyclic phosphodiesterase
LigandBDBM50052093
Substrate/Competitorn/a
Meas. Tech.ChEMBL_155196 (CHEMBL763669)
IC50>30000±n/a nM
Citation Iwasaki, TKondo, KKuroda, TMoritani, YYamagata, SSugiura, MKikkawa, HKaminuma, OIkezawa, K Novel selective PDE IV inhibitors as antiasthmatic agents. Synthesis and biological activities of a series of 1-aryl-2,3-bis(hydroxymethyl)naphthalene lignans. J Med Chem39:2696-704 (1996) 
 
cGMP-specific 3',5'-cyclic phosphodiesterase
Name:cGMP-specific 3',5'-cyclic phosphodiesterase
Type:Protein
Mol. Mass.:99975.83
Organism:Homo sapiens (Human)
Description:O76074
Residue:875
BDBM50052093
NameBDBM50052093
Synonyms:CHEMBL91728 | [7-Hydroxymethyl-5-(3,4,5-trimethoxy-phenyl)-naphtho[2,3-d][1,3]dioxol-6-yl]-methanol
TypeSmall organic molecule
Emp. Form.C22H22O7
Mol. Mass.398.4059
SMILESCOc1cc(cc(OC)c1OC)-c1c(CO)c(CO)cc2cc3OCOc3cc12