Reaction Details
TargetcGMP-specific 3',5'-cyclic phosphodiesterase
LigandBDBM50052094
Substrate/Competitorn/a
Meas. Tech.ChEMBL_155196 (CHEMBL763669)
IC50 30000±n/a nM
Citation Iwasaki, TKondo, KKuroda, TMoritani, YYamagata, SSugiura, MKikkawa, HKaminuma, OIkezawa, K Novel selective PDE IV inhibitors as antiasthmatic agents. Synthesis and biological activities of a series of 1-aryl-2,3-bis(hydroxymethyl)naphthalene lignans. J Med Chem39:2696-704 (1996) 
 
cGMP-specific 3',5'-cyclic phosphodiesterase
Name:cGMP-specific 3',5'-cyclic phosphodiesterase
Type:Protein
Mol. Mass.:99975.83
Organism:Homo sapiens (Human)
Description:O76074
Residue:875
BDBM50052094
NameBDBM50052094
Synonyms:CHEMBL542178 | [1-(3-Amino-4,5-dimethoxy-phenyl)-6,7-diethoxy-3-hydroxymethyl-naphthalen-2-yl]-methanol; hydrochloride
TypeSmall organic molecule
Emp. Form.C24H29NO6
Mol. Mass.427.4902
SMILESCCOc1cc2cc(CO)c(CO)c(-c3cc(N)c(OC)c(OC)c3)c2cc1OCC