Reaction Details
TargetcGMP-specific 3',5'-cyclic phosphodiesterase
LigandBDBM50052097
Substrate/Competitorn/a
Meas. Tech.ChEMBL_155196 (CHEMBL763669)
IC50 30000±n/a nM
Citation Iwasaki, TKondo, KKuroda, TMoritani, YYamagata, SSugiura, MKikkawa, HKaminuma, OIkezawa, K Novel selective PDE IV inhibitors as antiasthmatic agents. Synthesis and biological activities of a series of 1-aryl-2,3-bis(hydroxymethyl)naphthalene lignans. J Med Chem39:2696-704 (1996) 
 
cGMP-specific 3',5'-cyclic phosphodiesterase
Name:cGMP-specific 3',5'-cyclic phosphodiesterase
Type:Protein
Mol. Mass.:99975.83
Organism:Homo sapiens (Human)
Description:O76074
Residue:875
BDBM50052097
NameBDBM50052097
Synonyms:5-(2,3-Bis-hydroxymethyl-6,7-dimethoxy-naphthalen-1-yl)-2,3-dimethoxy-N,N-dimethyl-benzamide | CHEMBL90059
TypeSmall organic molecule
Emp. Form.C25H29NO7
Mol. Mass.455.5003
SMILESCOc1cc2cc(CO)c(CO)c(-c3cc(OC)c(OC)c(c3)C(=O)N(C)C)c2cc1OC