Reaction Details
TargetcGMP-specific 3',5'-cyclic phosphodiesterase
LigandBDBM50052087
Substrate/Competitorn/a
Meas. Tech.ChEMBL_155196 (CHEMBL763669)
IC50 3000±n/a nM
Citation Iwasaki, TKondo, KKuroda, TMoritani, YYamagata, SSugiura, MKikkawa, HKaminuma, OIkezawa, K Novel selective PDE IV inhibitors as antiasthmatic agents. Synthesis and biological activities of a series of 1-aryl-2,3-bis(hydroxymethyl)naphthalene lignans. J Med Chem39:2696-704 (1996) 
 
cGMP-specific 3',5'-cyclic phosphodiesterase
Name:cGMP-specific 3',5'-cyclic phosphodiesterase
Type:Protein
Mol. Mass.:99975.83
Organism:Homo sapiens (Human)
Description:O76074
Residue:875
BDBM50052087
NameBDBM50052087
Synonyms:CHEMBL91778 | [1-(3,4-Dimethoxy-phenyl)-3-hydroxymethyl-6,7-dimethoxy-naphthalen-2-yl]-methanol
TypeSmall organic molecule
Emp. Form.C22H24O6
Mol. Mass.384.4224
SMILESCOc1ccc(cc1OC)-c1c(CO)c(CO)cc2cc(OC)c(OC)cc12