Reaction Details
TargetcGMP-specific 3',5'-cyclic phosphodiesterase
LigandBDBM50052083
Substrate/Competitorn/a
Meas. Tech.ChEMBL_155196 (CHEMBL763669)
IC50 10000±n/a nM
Citation Iwasaki, TKondo, KKuroda, TMoritani, YYamagata, SSugiura, MKikkawa, HKaminuma, OIkezawa, K Novel selective PDE IV inhibitors as antiasthmatic agents. Synthesis and biological activities of a series of 1-aryl-2,3-bis(hydroxymethyl)naphthalene lignans. J Med Chem39:2696-704 (1996) 
 
cGMP-specific 3',5'-cyclic phosphodiesterase
Name:cGMP-specific 3',5'-cyclic phosphodiesterase
Type:Protein
Mol. Mass.:99975.83
Organism:Homo sapiens (Human)
Description:O76074
Residue:875
BDBM50052083
NameBDBM50052083
Synonyms:4-(2,3-Bis-hydroxymethyl-6,7-dimethoxy-naphthalen-1-yl)-3H-pyridin-2-one | CHEMBL328147
TypeSmall organic molecule
Emp. Form.C19H19NO5
Mol. Mass.341.3579
SMILESCOc1cc2cc(CO)c(CO)c(-c3cc[nH]c(=O)c3)c2cc1OC