Reaction Details
TargetcGMP-specific 3',5'-cyclic phosphodiesterase
LigandBDBM50052085
Substrate/Competitorn/a
Meas. Tech.ChEMBL_155196 (CHEMBL763669)
IC50 8000±n/a nM
Citation Iwasaki, TKondo, KKuroda, TMoritani, YYamagata, SSugiura, MKikkawa, HKaminuma, OIkezawa, K Novel selective PDE IV inhibitors as antiasthmatic agents. Synthesis and biological activities of a series of 1-aryl-2,3-bis(hydroxymethyl)naphthalene lignans. J Med Chem39:2696-704 (1996) 
 
cGMP-specific 3',5'-cyclic phosphodiesterase
Name:cGMP-specific 3',5'-cyclic phosphodiesterase
Type:Protein
Mol. Mass.:99975.83
Organism:Homo sapiens (Human)
Description:O76074
Residue:875
BDBM50052085
NameBDBM50052085
Synonyms:1-Butyl-4-(7-ethoxy-2,3-bis-hydroxymethyl-5-methoxy-naphthalen-1-yl)-3,6-dihydro-1H-pyridin-2-one | CHEMBL91042
TypeSmall organic molecule
Emp. Form.C24H31NO5
Mol. Mass.413.5066
SMILESCCCCN1CC=C(CC1=O)c1c(CO)c(CO)cc2c(OC)cc(OCC)cc12