Reaction Details
TargetcGMP-specific 3',5'-cyclic phosphodiesterase
LigandBDBM50052096
Substrate/Competitorn/a
Meas. Tech.ChEMBL_155196 (CHEMBL763669)
IC50 22000±n/a nM
Citation Iwasaki, TKondo, KKuroda, TMoritani, YYamagata, SSugiura, MKikkawa, HKaminuma, OIkezawa, K Novel selective PDE IV inhibitors as antiasthmatic agents. Synthesis and biological activities of a series of 1-aryl-2,3-bis(hydroxymethyl)naphthalene lignans. J Med Chem39:2696-704 (1996) 
 
cGMP-specific 3',5'-cyclic phosphodiesterase
Name:cGMP-specific 3',5'-cyclic phosphodiesterase
Type:Protein
Mol. Mass.:99975.83
Organism:Homo sapiens (Human)
Description:O76074
Residue:875
BDBM50052096
NameBDBM50052096
Synonyms:4-(2,3-Bis-hydroxymethyl-6,7-dimethoxy-naphthalen-1-yl)-1-(2-methoxy-ethyl)-3,6-dihydro-1H-pyridin-2-one | CHEMBL90469
TypeSmall organic molecule
Emp. Form.C22H27NO6
Mol. Mass.401.4529
SMILESCOCCN1CC=C(CC1=O)c1c(CO)c(CO)cc2cc(OC)c(OC)cc12