Reaction Details
TargetTranslocator protein
LigandBDBM81939
Substrate/Competitorn/a
Meas. Tech.ChEMBL_39446 (CHEMBL653022)
IC50 1.4±n/a nM
Citation Campiani, GFiorini, IDe Filippis, MPCiani, SMGarofalo, ANacci, VGiorgi, GSega, ABotta, MChiarini, ABudriesi, RBruni, GRomeo, MRManzoni, CMennini, T Cardiovascular characterization of pyrrolo[2,1-d][1,5]benzothiazepine derivatives binding selectively to the peripheral-type benzodiazepine receptor (PBR): from dual PBR affinity and calcium antagonist activity to novel and selective calcium entry blockers. J Med Chem39:2922-38 (1996) 
 
Translocator protein
Name:Translocator protein
Type:Mitochondrion membrane protein
Mol. Mass.:18945.84
Organism:Rattus norvegicus (rat)
Description:Competitive binding experiments were performed on rat kidney mitochondrial membranes.
Residue:169
BDBM81939
NameBDBM81939
Synonyms:CAS_52-53-9 VERAPAMIL
TypeSmall organic molecule
Emp. Form.C27H38N2O4
Mol. Mass.454.6016
SMILESCOc1ccc(CCN(C)CCCC(C#N)(C(C)C)c2ccc(OC)c(OC)c2)cc1OC