Reaction Details
TargetVoltage-dependent L-type calcium channel subunit alpha-1C
LigandBDBM50041493
Substrate/Competitorn/a
Meas. Tech.ChEMBL_42932 (CHEMBL876248)
IC50 220±n/a nM
Citation Campiani, GFiorini, IDe Filippis, MPCiani, SMGarofalo, ANacci, VGiorgi, GSega, ABotta, MChiarini, ABudriesi, RBruni, GRomeo, MRManzoni, CMennini, T Cardiovascular characterization of pyrrolo[2,1-d][1,5]benzothiazepine derivatives binding selectively to the peripheral-type benzodiazepine receptor (PBR): from dual PBR affinity and calcium antagonist activity to novel and selective calcium entry blockers. J Med Chem39:2922-38 (1996) 
 
Voltage-dependent L-type calcium channel subunit alpha-1C
Name:Voltage-dependent L-type calcium channel subunit alpha-1C
Type:Enzyme Catalytic Domain
Mol. Mass.:243492.26
Organism:RAT
Description:Calcium channel 0 RAT::P22002
Residue:2169
BDBM50041493
NameBDBM50041493
Synonyms:Acetic acid 5-phenyl-6-thia-10b-aza-benzo[e]azulen-4-yl ester | CHEMBL33083
TypeSmall organic molecule
Emp. Form.C20H15NO2S
Mol. Mass.333.404
SMILESCC(=O)OC1=C(Sc2ccccc2-n2cccc12)c1ccccc1