Reaction Details
TargetVoltage-dependent L-type calcium channel subunit alpha-1C
LigandBDBM50029417
Substrate/Competitorn/a
Meas. Tech.ChEMBL_42931 (CHEMBL654574)
IC50 17±n/a nM
Citation Campiani, GFiorini, IDe Filippis, MPCiani, SMGarofalo, ANacci, VGiorgi, GSega, ABotta, MChiarini, ABudriesi, RBruni, GRomeo, MRManzoni, CMennini, T Cardiovascular characterization of pyrrolo[2,1-d][1,5]benzothiazepine derivatives binding selectively to the peripheral-type benzodiazepine receptor (PBR): from dual PBR affinity and calcium antagonist activity to novel and selective calcium entry blockers. J Med Chem39:2922-38 (1996) 
 
Voltage-dependent L-type calcium channel subunit alpha-1C
Name:Voltage-dependent L-type calcium channel subunit alpha-1C
Type:Enzyme Catalytic Domain
Mol. Mass.:243492.26
Organism:RAT
Description:Calcium channel 0 RAT::P22002
Residue:2169
BDBM50029417
NameBDBM50029417
Synonyms:CHEMBL277363 | [4-(4-Methoxy-phenyl)-4H-benzo[b]pyrrolo[1,2-d][1,4]thiazin-1-ylmethyl]-dimethyl-amine
TypeSmall organic molecule
Emp. Form.C21H22N2OS
Mol. Mass.350.477
SMILESCOc1ccc(cc1)C1Sc2ccccc2-n2c(CN(C)C)ccc12