Reaction Details
TargetTranslocator protein
LigandBDBM50052751
Substrate/Competitorn/a
Meas. Tech.ChEMBL_37054 (CHEMBL652443)
Ki 1±n/a nM
Citation Campiani, GNacci, VFiorini, IDe Filippis, MPGarofalo, ACiani, SMGreco, GNovellino, EWilliams, DCZisterer, DMWoods, MJMihai, CManzoni, CMennini, T Synthesis, biological activity, and SARs of pyrrolobenzoxazepine derivatives, a new class of specific"peripheral-type" benzodiazepine receptor ligands. J Med Chem39:3435-50 (1996) 
 
Translocator protein
Name:Translocator protein
Type:Mitochondrion membrane protein
Mol. Mass.:18945.84
Organism:Rattus norvegicus (rat)
Description:Competitive binding experiments were performed on rat kidney mitochondrial membranes.
Residue:169
BDBM50052751
NameBDBM50052751
Synonyms:CHEMBL325169 | Dimethyl-carbamic acid 5-phenyl-6-oxa-10b-aza-benzo[e]azulen-4-yl ester
TypeSmall organic molecule
Emp. Form.C21H18N2O3
Mol. Mass.346.3792
SMILESCN(C)C(=O)OC1=C(Oc2ccccc2-n2cccc12)c1ccccc1