Reaction Details
TargetPenicillin-binding protein, transpeptidase domain protein
LigandBDBM50053175
Substrate/Competitorn/a
Meas. Tech.ChEMBL_153668 (CHEMBL758012)
IC50>300000±n/a nM
Citation Richter, HGAngehrn, PHubschwerlen, CKania, MPage, MGSpecklin, JLWinkler, FK Design, synthesis, and evaluation of 2 beta-alkenyl penam sulfone acids as inhibitors of beta-lactamases. J Med Chem39:3712-22 (1996) 
 
Penicillin-binding protein, transpeptidase domain protein
Name:Penicillin-binding protein, transpeptidase domain protein
Type:PROTEIN
Mol. Mass.:77257.38
Organism:Staphylococcus aureus
Description:ChEMBL_153668
Residue:691
BDBM50053175
NameBDBM50053175
Synonyms:(2S,3S,5R)-3-Methyl-4,4,7-trioxo-3-((E)-2-thiazol-5-yl-vinyl)-4lambda*6*-thia-1-aza-bicyclo[3.2.0]heptane-2-carboxylic acid | CHEMBL333330
TypeSmall organic molecule
Emp. Form.C12H12N2O5S2
Mol. Mass.328.364
SMILESC[C@]1(\C=C\c2cncs2)[C@@H](N2[C@@H](CC2=O)S1(=O)=O)C(O)=O