Reaction Details
TargetPenicillin-binding protein 2
LigandBDBM50076680
Substrate/Competitorn/a
Meas. Tech.ChEMBL_153657 (CHEMBL762722)
IC50 17000±n/a nM
Citation Richter, HGAngehrn, PHubschwerlen, CKania, MPage, MGSpecklin, JLWinkler, FK Design, synthesis, and evaluation of 2 beta-alkenyl penam sulfone acids as inhibitors of beta-lactamases. J Med Chem39:3712-22 (1996) 
 
Penicillin-binding protein 2
Name:Penicillin-binding protein 2
Type:PROTEIN
Mol. Mass.:79295.25
Organism:Staphylococcus aureus
Description:ChEMBL_153530
Residue:716
BDBM50076680
NameBDBM50076680
Synonyms:CHEMBL6461 Sodium; (2S,3R,5R)-3-((Z)-2-cyano-vinyl)-3-methyl-4,4,7-trioxo-4lambda*6*-thia-1-aza-bicyclo[3.2.0]heptane-2-carboxylate | Sodium; (2S,3S,5R)-3-((Z)-2-cyano-vinyl)-3-methyl-4,4,7-trioxo-4lambda*6*-thia-1-aza-bicyclo[3.2.0]heptane-2-carboxylate
TypeSmall organic molecule
Emp. Form.C10H9N2O5S
Mol. Mass.269.254
SMILESC[C@]1(\C=C\C#N)[C@@H](N2[C@@H](CC2=O)S1(=O)=O)C([O-])=O