Reaction Details
TargetPenicillin-binding protein 1B
LigandBDBM50053183
Substrate/Competitorn/a
Meas. Tech.ChEMBL_153527 (CHEMBL763467)
IC50>10000000±n/a nM
Citation Richter, HGAngehrn, PHubschwerlen, CKania, MPage, MGSpecklin, JLWinkler, FK Design, synthesis, and evaluation of 2 beta-alkenyl penam sulfone acids as inhibitors of beta-lactamases. J Med Chem39:3712-22 (1996) 
 
Penicillin-binding protein 1B
Name:Penicillin-binding protein 1B
Type:PROTEIN
Mol. Mass.:94304.04
Organism:Escherichia coli (strain K12)
Description:ChEMBL_153527
Residue:844
BDBM50053183
NameBDBM50053183
Synonyms:CHEMBL123481 | Trifluoro-methanesulfonate1-[(E)-3-((2S,3S,5R)-2-carboxy-3-methyl-4,4,7-trioxo-4lambda*6*-thia-1-aza-bicyclo[3.2.0]hept-3-yl)-allyl]-pyridinium;
TypeSmall organic molecule
Emp. Form.C15H17N2O5S
Mol. Mass.337.37
SMILESC[C@]1(\C=C\C[n+]2ccccc2)[C@@H](N2[C@@H](CC2=O)S1(=O)=O)C(O)=O