Reaction Details
Target5-hydroxytryptamine receptor 1A
LigandBDBM50030004
Substrate/Competitorn/a
Meas. Tech.ChEMBL_1124 (CHEMBL616069)
Ki 0.70±n/a nM
Citation Höök, BBCortizo, LJohansson, AMWestlind-Danielsson, AMohell, NHacksell, U Derivatives of (R)- and (S)-5-fluoro-8-hydroxy-2-(dipropylamino)tetralin: synthesis and interactions with 5-HT1A receptors. J Med Chem39:4036-43 (1996) 
 
5-hydroxytryptamine receptor 1A
Name:5-hydroxytryptamine receptor 1A
Type:G Protein-Coupled Receptor (GPCR)
Mol. Mass.:46445.29
Organism:Rattus norvegicus (rat)
Description:Binding assays were performed using rat hippocampal membranes.
Residue:422
BDBM50030004
NameBDBM50030004
Synonyms:1-((S)-7-Dipropylamino-5,6,7,8-tetrahydro-naphthalen-1-yl)-ethanone CHEMBL87195
TypeSmall organic molecule
Emp. Form.C18H27NO
Mol. Mass.273.4131
SMILESCCCN(CCC)[C@H]1CCc2cccc(C(C)=O)c2C1