Reaction Details
TargetDihydroorotate dehydrogenase (quinone), mitochondrial
LigandBDBM50054560
Substrate/Competitorn/a
Meas. Tech.ChEMBL_52873 (CHEMBL666232)
IC50 55±n/a nM
Citation Kuo, EAHambleton, PTKay, DPEvans, PLMatharu, SSLittle, EMcDowall, NJones, CBHedgecock, CJYea, CMChan, AWHairsine, PWAger, IRTully, WRWilliamson, RAWestwood, R Synthesis, structure-activity relationships, and pharmacokinetic properties of dihydroorotate dehydrogenase inhibitors: 2-cyano-3-cyclopropyl-3-hydroxy-N-[3'-methyl-4'-(trifluoromethyl)phenyl ] propenamide and related compounds. J Med Chem39:4608-21 (1996) 
 
Dihydroorotate dehydrogenase (quinone), mitochondrial
Name:Dihydroorotate dehydrogenase (quinone), mitochondrial
Type:PROTEIN
Mol. Mass.:42711.08
Organism:Mus musculus
Description:ChEMBL_1366444
Residue:395
BDBM50054560
NameBDBM50054560
Synonyms:(Z)-2-Cyano-3-cyclopropyl-3-hydroxy-N-(3-methyl-4-trifluoromethyl-phenyl)-acrylamide Laflunimus
TypeSmall organic molecule
Emp. Form.C15H13F3N2O2
Mol. Mass.310.2711
SMILESCc1cc(NC(=O)C(C#N)C(=O)C2CC2)ccc1C(F)(F)F