Reaction Details
TargetDihydroorotate dehydrogenase (quinone), mitochondrial
LigandBDBM50054564
Substrate/Competitorn/a
Meas. Tech.ChEMBL_52874 (CHEMBL666233)
IC50 40±n/a nM
Citation Kuo, EAHambleton, PTKay, DPEvans, PLMatharu, SSLittle, EMcDowall, NJones, CBHedgecock, CJYea, CMChan, AWHairsine, PWAger, IRTully, WRWilliamson, RAWestwood, R Synthesis, structure-activity relationships, and pharmacokinetic properties of dihydroorotate dehydrogenase inhibitors: 2-cyano-3-cyclopropyl-3-hydroxy-N-[3'-methyl-4'-(trifluoromethyl)phenyl ] propenamide and related compounds. J Med Chem39:4608-21 (1996) 
 
Dihydroorotate dehydrogenase (quinone), mitochondrial
Name:Dihydroorotate dehydrogenase (quinone), mitochondrial
Type:Enzyme
Mol. Mass.:42672.97
Organism:Rattus norvegicus (rat)
Description:The enzyme assay was performed with the histidine-tagged enzyme without cleavage of the tag.
Residue:395
BDBM50054564
NameBDBM50054564
Synonyms:(Z)-2-Cyano-3-cyclopropyl-N-(3-ethyl-4-trifluoromethyl-phenyl)-3-hydroxy-acrylamide | CHEMBL357459
TypeSmall organic molecule
Emp. Form.C16H15F3N2O2
Mol. Mass.324.2977
SMILESCCc1cc(NC(=O)C(C#N)C(=O)C2CC2)ccc1C(F)(F)F