Reaction Details
TargetSodium-dependent dopamine transporter
LigandBDBM22167
Substrate/Competitorn/a
Meas. Tech.ChEMBL_61858 (CHEMBL671002)
IC50 4.1±n/a nM
Citation Matecka, DRothman, RBRadesca, Lde Costa, BRDersch, CMPartilla, JSPert, AGlowa, JRWojnicki, FHRice, KC Development of novel, potent, and selective dopamine reuptake inhibitors through alteration of the piperazine ring of 1-[2-(diphenylmethoxy)ethyl]-and 1-[2-[bis(4-fluorophenyl)methoxy]ethyl]-4-(3-phenylpropyl)piperazines (GBR 12935 and GBR 12909). J Med Chem39:4704-16 (1997) 
 
Sodium-dependent dopamine transporter
Name:Sodium-dependent dopamine transporter
Type:Multi-pass membrane protein
Mol. Mass.:68749.45
Organism:Rattus norvegicus (rat)
Description:P23977
Residue:619
BDBM22167
NameBDBM22167
Synonyms:1-[2-(diphenylmethoxy)ethyl]-4-(3-phenylpropyl)piperazine CHEMBL434080 GBR-12935
TypeSmall organic molecule
Emp. Form.C28H34N2O
Mol. Mass.414.5824
SMILESC(CN1CCN(CCOC(c2ccccc2)c2ccccc2)CC1)Cc1ccccc1