Reaction Details
TargetD(1A) dopamine receptor
LigandBDBM50029051
Substrate/Competitorn/a
Meas. Tech.ChEMBL_59012 (CHEMBL669035)
Kd 50000±n/a nM
Citation Brusniak, MYPearlman, RSNeve, KAWilcox, RE Comparative molecular field analysis-based prediction of drug affinities at recombinant D1A dopamine receptors. J Med Chem39:850-9 (1996) 
 
D(1A) dopamine receptor
Name:D(1A) dopamine receptor
Type:Enzyme
Mol. Mass.:49303.43
Organism:Homo sapiens (Human)
Description:P21728
Residue:446
BDBM50029051
NameBDBM50029051
Synonyms:(-)-arterenol (-)-norepinephrine (R)-4-(2-amino-1-hydroxyethyl)-1,2-benzenediol (R)-norepinephrine CHEMBL1437 | NOREPINEPHRINE
TypeSmall organic molecule
Emp. Form.C8H11NO3
Mol. Mass.169.1778
SMILESNC[C@H](O)c1ccc(O)c(O)c1