Reaction Details
TargetKappa-type opioid receptor
LigandBDBM50050753
Substrate/Competitorn/a
Meas. Tech.ChEMBL_145932 (CHEMBL752598)
IC50 62±n/a nM
Citation Chang, ACChao, CCTakemori, AEGekker, GHu, SPeterson, PKPortoghese, PS Arylacetamide-derived fluorescent probes: synthesis, biological evaluation, and direct fluorescent labeling of kappa opioid receptors in mouse microglial cells. J Med Chem39:1729-35 (1996) 
 
Kappa-type opioid receptor
Name:Kappa-type opioid receptor
Type:G Protein-Coupled Receptor (GPCR)
Mol. Mass.:42744.99
Organism:Cavia porcellus (domestic guinea pig)
Description:P41144
Residue:380
BDBM50050753
NameBDBM50050753
Synonyms:5-(3-{[4-(1-{[2-(3,4-Dichloro-phenyl)-acetyl]-methyl-amino}-2-pyrrolidin-1-yl-ethyl)-phenylcarbamoyl]-methyl}-thioureido)-2-(6-hydroxy-3-oxo-3H-xanthen-9-yl)-benzoic acid; compound with triethyl-amine | CHEMBL49591
TypeSmall organic molecule
Emp. Form.C44H39Cl2N5O7S
Mol. Mass.852.781
SMILES[#6]-[#7](-[#6](-[#6]-[#7]-1-[#6]-[#6]-[#6]-[#6]-1)-c1ccc(-[#7]-[#6](=O)-[#6]-[#7]-[#6](=S)-[#7]=[#6]-2-[#6]=[#6]\[#6](-[#6](=[#6]-2)-[#6](-[#8])=O)=[#6]-2\c3ccc(-[#8])cc3-[#8]-c3cc(-[#8])ccc-23)cc1)-[#6](=O)-[#6]-c1ccc(Cl)c(Cl)c1