Reaction Details
TargetKappa-type opioid receptor
LigandBDBM50369222
Substrate/Competitorn/a
Meas. Tech.ChEMBL_145552 (CHEMBL751016)
IC50 1.5±n/a nM
Citation Chang, ACChao, CCTakemori, AEGekker, GHu, SPeterson, PKPortoghese, PS Arylacetamide-derived fluorescent probes: synthesis, biological evaluation, and direct fluorescent labeling of kappa opioid receptors in mouse microglial cells. J Med Chem39:1729-35 (1996) 
 
Kappa-type opioid receptor
Name:Kappa-type opioid receptor
Type:Enzyme
Mol. Mass.:42656.78
Organism:Mus musculus (Mouse)
Description:P33534
Residue:380
BDBM50369222
NameBDBM50369222
Synonyms:CHEMBL1907789
TypeSmall organic molecule
Emp. Form.C46H42Cl2N6O8S
Mol. Mass.909.832
SMILES[#6]-[#7](-[#6@H](-[#6]-[#7]-1-[#6]-[#6]-[#6]-[#6]-1)-c1cccc(-[#7]-[#6](=O)-[#6]-[#7]-[#6](=O)-[#6]-[#7]-[#6](=S)-[#7]=[#6]-2-[#6]=[#6]\[#6](-[#6](=[#6]-2)-[#6](-[#8])=O)=[#6]-2\c3ccc(-[#8])cc3-[#8]-c3cc(-[#8])ccc-23)c1)-[#6](=O)-[#6]-c1ccc(Cl)c(Cl)c1