Reaction Details
TargetKappa-type opioid receptor
LigandBDBM50035474
Substrate/Competitorn/a
Meas. Tech.ChEMBL_145552 (CHEMBL751016)
IC50 4.5±n/a nM
Citation Chang, ACChao, CCTakemori, AEGekker, GHu, SPeterson, PKPortoghese, PS Arylacetamide-derived fluorescent probes: synthesis, biological evaluation, and direct fluorescent labeling of kappa opioid receptors in mouse microglial cells. J Med Chem39:1729-35 (1996) 
 
Kappa-type opioid receptor
Name:Kappa-type opioid receptor
Type:Enzyme
Mol. Mass.:42656.78
Organism:Mus musculus (Mouse)
Description:P33534
Residue:380
BDBM50035474
NameBDBM50035474
Synonyms:CHEMBL48344 | N-[1-(4-Amino-phenyl)-2-pyrrolidin-1-yl-ethyl]-2-(3,4-dichloro-phenyl)-N-methyl-acetamide
TypeSmall organic molecule
Emp. Form.C21H25Cl2N3O
Mol. Mass.406.349
SMILESCN(C(CN1CCCC1)c1ccc(N)cc1)C(=O)Cc1ccc(Cl)c(Cl)c1