Reaction Details
TargetD(2) dopamine receptor
LigandBDBM50408147
Substrate/Competitorn/a
Meas. Tech.ChEMBL_61448 (CHEMBL670674)
Ki 240±n/a nM
Citation Michaelides, MRHong, YDiDomenico, SBayburt, EKAsin, KEBritton, DRLin, CWShiosaki, K Substituted hexahydrobenzo[f]thieno[c]quinolines as dopamine D1-selective agonists: synthesis and biological evaluation in vitro and in vivo. J Med Chem40:1585-99 (1997) 
 
D(2) dopamine receptor
Name:D(2) dopamine receptor
Type:G Protein-Coupled Receptor (GPCR)
Mol. Mass.:50931.60
Organism:Rattus norvegicus (rat)
Description:P61169
Residue:444
BDBM50408147
NameBDBM50408147
Synonyms:CHEMBL2114440
TypeSmall organic molecule
Emp. Form.C16H17NO2S
Mol. Mass.287.377
SMILESCc1cc2[C@H]3[C@@H](CCc4cc(O)c(O)cc34)NCc2s1