Reaction Details
TargetD(2) dopamine receptor
LigandBDBM50408146
Substrate/Competitorn/a
Meas. Tech.ChEMBL_61448 (CHEMBL670674)
Ki 345±n/a nM
Citation Michaelides, MRHong, YDiDomenico, SBayburt, EKAsin, KEBritton, DRLin, CWShiosaki, K Substituted hexahydrobenzo[f]thieno[c]quinolines as dopamine D1-selective agonists: synthesis and biological evaluation in vitro and in vivo. J Med Chem40:1585-99 (1997) 
 
D(2) dopamine receptor
Name:D(2) dopamine receptor
Type:G Protein-Coupled Receptor (GPCR)
Mol. Mass.:50931.60
Organism:Rattus norvegicus (rat)
Description:P61169
Residue:444
BDBM50408146
NameBDBM50408146
Synonyms:CHEMBL2114444
TypeSmall organic molecule
Emp. Form.C17H19NO2S
Mol. Mass.301.403
SMILESCCc1cc2[C@H]3[C@@H](CCc4cc(O)c(O)cc34)NCc2s1