Reaction Details
TargetD(1A) dopamine receptor
LigandBDBM50057840
Substrate/Competitorn/a
Meas. Tech.ChEMBL_59009 (CHEMBL668873)
Ki 45±n/a nM
Citation Michaelides, MRHong, YDiDomenico, SBayburt, EKAsin, KEBritton, DRLin, CWShiosaki, K Substituted hexahydrobenzo[f]thieno[c]quinolines as dopamine D1-selective agonists: synthesis and biological evaluation in vitro and in vivo. J Med Chem40:1585-99 (1997) 
 
D(1A) dopamine receptor
Name:D(1A) dopamine receptor
Type:Enzyme Catalytic Domain
Mol. Mass.:49429.75
Organism:RAT
Description:P18901
Residue:446
BDBM50057840
NameBDBM50057840
Synonyms:(5aR,11bS)-4,5,5a,6,7,11b-Hexahydro-2-thia-5-aza-cyclopenta[c]phenanthrene-9,10-diol; hydrobromide | CHEMBL554571
TypeSmall organic molecule
Emp. Form.C15H15NO2S
Mol. Mass.273.35
SMILESOc1cc2CC[C@H]3NCc4cscc4[C@@H]3c2cc1O