Reaction Details
TargetD(1A) dopamine receptor
LigandBDBM50057844
Substrate/Competitorn/a
Meas. Tech.ChEMBL_59009 (CHEMBL668873)
Ki 280±n/a nM
Citation Michaelides, MRHong, YDiDomenico, SBayburt, EKAsin, KEBritton, DRLin, CWShiosaki, K Substituted hexahydrobenzo[f]thieno[c]quinolines as dopamine D1-selective agonists: synthesis and biological evaluation in vitro and in vivo. J Med Chem40:1585-99 (1997) 
 
D(1A) dopamine receptor
Name:D(1A) dopamine receptor
Type:Enzyme Catalytic Domain
Mol. Mass.:49429.75
Organism:RAT
Description:P18901
Residue:446
BDBM50057844
NameBDBM50057844
Synonyms:(5aS,11bS)-2-Cyclopentylmethyl-4,5,5a,6,7,11b-hexahydro-1-thia-5-aza-cyclopenta[c]phenanthrene-9,10-diol | CHEMBL287931
TypeSmall organic molecule
Emp. Form.C21H25NO2S
Mol. Mass.355.494
SMILESOc1cc2CC[C@@H]3NCc4cc(CC5CCCC5)sc4[C@H]3c2cc1O