Reaction Details
TargetD(1A) dopamine receptor
LigandBDBM50057855
Substrate/Competitorn/a
Meas. Tech.ChEMBL_59009 (CHEMBL668873)
Ki 52±n/a nM
Citation Michaelides, MRHong, YDiDomenico, SBayburt, EKAsin, KEBritton, DRLin, CWShiosaki, K Substituted hexahydrobenzo[f]thieno[c]quinolines as dopamine D1-selective agonists: synthesis and biological evaluation in vitro and in vivo. J Med Chem40:1585-99 (1997) 
 
D(1A) dopamine receptor
Name:D(1A) dopamine receptor
Type:Enzyme Catalytic Domain
Mol. Mass.:49429.75
Organism:RAT
Description:P18901
Residue:446
BDBM50057855
NameBDBM50057855
Synonyms:(5aS,11bR)-2-Isobutyl-4,5,5a,6,7,11b-hexahydro-3-thia-5-aza-cyclopenta[c]phenanthrene-9,10-diol | CHEMBL288846
TypeSmall organic molecule
Emp. Form.C19H23NO2S
Mol. Mass.329.456
SMILESCC(C)Cc1cc2[C@@H]3[C@H](CCc4cc(O)c(O)cc34)NCc2s1