Reaction Details
TargetD(2) dopamine receptor
LigandBDBM50057856
Substrate/Competitorn/a
Meas. Tech.ChEMBL_61448 (CHEMBL670674)
Ki 100±n/a nM
Citation Michaelides, MRHong, YDiDomenico, SBayburt, EKAsin, KEBritton, DRLin, CWShiosaki, K Substituted hexahydrobenzo[f]thieno[c]quinolines as dopamine D1-selective agonists: synthesis and biological evaluation in vitro and in vivo. J Med Chem40:1585-99 (1997) 
 
D(2) dopamine receptor
Name:D(2) dopamine receptor
Type:G Protein-Coupled Receptor (GPCR)
Mol. Mass.:50931.60
Organism:Rattus norvegicus (rat)
Description:P61169
Residue:444
BDBM50057856
NameBDBM50057856
Synonyms:(5aR,11bS)-3-Propyl-4,5,5a,6,7,11b-hexahydro-2-thia-5-aza-cyclopenta[c]phenanthrene-9,10-diol; TFA | CHEMBL41238
TypeSmall organic molecule
Emp. Form.C18H21NO2S
Mol. Mass.315.43
SMILESCCCc1scc2[C@H]3[C@@H](CCc4cc(O)c(O)cc34)NCc12