Reaction Details
TargetKappa-type opioid receptor
LigandBDBM50058150
Substrate/Competitorn/a
Meas. Tech.ChEMBL_145567 (CHEMBL749571)
Ki 1029±n/a nM
Citation Ohkawa, SDiGiacomo, BLarson, DLTakemori, AEPortoghese, PS 7-Spiroindanyl derivatives of naltrexone and oxymorphone as selective ligands for delta opioid receptors. J Med Chem40:1720-5 (1997) 
 
Kappa-type opioid receptor
Name:Kappa-type opioid receptor
Type:Enzyme
Mol. Mass.:42656.78
Organism:Mus musculus (Mouse)
Description:P33534
Residue:380
BDBM50058150
NameBDBM50058150
Synonyms:7-(5',6'-Benzo-2'-spiroindanyl)naltrexone | CHEMBL49704
TypeSmall organic molecule
Emp. Form.C32H31NO4
Mol. Mass.493.5928
SMILESOc1ccc2CC3N(CC4CC4)CCC45C(Oc1c24)C(=O)C1(Cc2cc4ccccc4cc2C1)C[C@@]35O