Reaction Details
TargetKappa-type opioid receptor
LigandBDBM50058153
Substrate/Competitorn/a
Meas. Tech.ChEMBL_145567 (CHEMBL749571)
Ki>3000±n/a nM
Citation Ohkawa, SDiGiacomo, BLarson, DLTakemori, AEPortoghese, PS 7-Spiroindanyl derivatives of naltrexone and oxymorphone as selective ligands for delta opioid receptors. J Med Chem40:1720-5 (1997) 
 
Kappa-type opioid receptor
Name:Kappa-type opioid receptor
Type:Enzyme
Mol. Mass.:42656.78
Organism:Mus musculus (Mouse)
Description:P33534
Residue:380
BDBM50058153
NameBDBM50058153
Synonyms:7-(5',6'-Benzo-2'-spiroindanyl)oxymorphone | CHEMBL297470
TypeSmall organic molecule
Emp. Form.C29H27NO4
Mol. Mass.453.529
SMILESCN1CCC23C4Oc5c2c(CC1[C@]3(O)CC1(Cc2cc3ccccc3cc2C1)C4=O)ccc5O