Reaction Details
TargetKappa-type opioid receptor
LigandBDBM50297170
Substrate/Competitorn/a
Meas. Tech.ChEMBL_145965 (CHEMBL752816)
Ki>3000±n/a nM
Citation Ohkawa, SDiGiacomo, BLarson, DLTakemori, AEPortoghese, PS 7-Spiroindanyl derivatives of naltrexone and oxymorphone as selective ligands for delta opioid receptors. J Med Chem40:1720-5 (1997) 
 
Kappa-type opioid receptor
Name:Kappa-type opioid receptor
Type:G Protein-Coupled Receptor (GPCR)
Mol. Mass.:42648.76
Organism:Homo sapiens (Human)
Description:P41145
Residue:380
BDBM50297170
NameBDBM50297170
Synonyms:7-(2'-spiroindanyl)oxymorphone 7-spiroindanyloxymorphone SIOM | Spiroindanyloxymorphone
TypeSmall organic molecule
Emp. Form.C25H25NO4
Mol. Mass.403.4703
SMILESCN1CC[C@@]23[C@H]4Oc5c2c(C[C@@H]1[C@]3(O)CC1(Cc2ccccc2C1)C4=O)ccc5O