Reaction Details
TargetDelta-type opioid receptor
LigandBDBM50058154
Substrate/Competitorn/a
Meas. Tech.ChEMBL_146345 (CHEMBL753794)
Ki 0.028000±n/a nM
Citation Ohkawa, SDiGiacomo, BLarson, DLTakemori, AEPortoghese, PS 7-Spiroindanyl derivatives of naltrexone and oxymorphone as selective ligands for delta opioid receptors. J Med Chem40:1720-5 (1997) 
 
Delta-type opioid receptor
Name:Delta-type opioid receptor
Type:Enzyme Catalytic Domain
Mol. Mass.:40577.25
Organism:MOUSE
Description:P32300
Residue:372
BDBM50058154
NameBDBM50058154
Synonyms:7-(4'-Methoxy-2'-spiroindanyl)naltrexone | CHEMBL297933
TypeSmall organic molecule
Emp. Form.C29H31NO5
Mol. Mass.473.5601
SMILESCOc1cccc2CC3(Cc12)C[C@@]1(O)C2Cc4ccc(O)c5OC(C3=O)C1(CCN2CC1CC1)c45