Reaction Details
TargetNitric oxide synthase, brain
LigandBDBM50058456
Substrate/Competitorn/a
Meas. Tech.ChEMBL_143376 (CHEMBL880847)
Ki 800±n/a nM
Citation Shearer, BGLee, SOplinger, JAFrick, LWGarvey, EPFurfine, ES Substituted N-phenylisothioureas: potent inhibitors of human nitric oxide synthase with neuronal isoform selectivity. J Med Chem40:1901-5 (1997) 
 
Nitric oxide synthase, brain
Name:Nitric oxide synthase, brain
Type:Homodimer
Mol. Mass.:160985.98
Organism:Homo sapiens (Human)
Description:P29475
Residue:1434
BDBM50058456
NameBDBM50058456
Synonyms:2-Ethyl-1-pyridin-4-yl-isothiourea; hydrofluoride CHEMBL542859
TypeSmall organic molecule
Emp. Form.C8H11N3S
Mol. Mass.181.258
SMILESCCSC(N)=Nc1ccncc1