Reaction Details
TargetNitric oxide synthase, inducible
LigandBDBM50058445
Substrate/Competitorn/a
Meas. Tech.ChEMBL_89177 (CHEMBL700496)
Ki 3100±n/a nM
Citation Shearer, BGLee, SOplinger, JAFrick, LWGarvey, EPFurfine, ES Substituted N-phenylisothioureas: potent inhibitors of human nitric oxide synthase with neuronal isoform selectivity. J Med Chem40:1901-5 (1997) 
 
Nitric oxide synthase, inducible
Name:Nitric oxide synthase, inducible
Type:Homodimer
Mol. Mass.:131141.95
Organism:Homo sapiens (Human)
Description:P35228
Residue:1153
BDBM50058445
NameBDBM50058445
Synonyms:2-Ethyl-1-(4-phenoxy-phenyl)-isothiourea; hydriodide CHEMBL540783
TypeSmall organic molecule
Emp. Form.C15H16N2OS
Mol. Mass.272.365
SMILESCCSC(N)=Nc1ccc(Oc2ccccc2)cc1